Target
Sodium- and chloride-dependent glycine transporter 2
Ligand
BDBM50322429
Substrate
Meas. Tech.
ChEMBL_643223 (CHEMBL1177034)
EC50
>30000±n/a nM
Citation
 Pinard, EAlanine, AAlberati, DBender, MBorroni, EBourdeaux, PBrom, VBurner, SFischer, HHainzl, DHalm, RHauser, NJolidon, SLengyel, JMarty, HPMeyer, TMoreau, JLMory, RNarquizian, RNettekoven, MNorcross, RDPuellmann, BSchmid, PSchmitt, SStalder, HWermuth, RWettstein, JGZimmerli, D Selective GlyT1 inhibitors: discovery of [4-(3-fluoro-5-trifluoromethylpyridin-2-yl)piperazin-1-yl][5-methanesulfonyl-2-((S)-2,2,2-trifluoro-1-methylethoxy)phenyl]methanone (RG1678), a promising novel medicine to treat schizophrenia. J Med Chem 53:4603-14 (2010)  
Target
Name:
Sodium- and chloride-dependent glycine transporter 2
Synonyms:
GLYT2 NET1 SLC6A5 | Sodium- and chloride-dependent glycine transporter 2
Type:
Enzyme Catalytic Domain
Mol. Mass.:
87438.56
Organism:
Homo sapiens (Human)
Description:
Glycine-2-transporter 0 HUMAN::Q9Y345
Residue:
797
  
Inhibitor
Name:
BDBM50322429
Synonyms:
CHEMBL1171499 | rac-[5-Methanesulfonyl-2-(2,2,2-trifluoro-1-methyl-ethoxy)-phenyl]-[4-(4-trifluoromethylphenyl)-piperazin-1-yl]-methanone
Type:
Small organic molecule
Emp. Form.:
C22H22F6N2O4S
Mol. Mass.:
524.476
SMILES:
CC(Oc1ccc(cc1C(=O)N1CCN(CC1)c1ccc(cc1)C(F)(F)F)S(C)(=O)=O)C(F)(F)F
: