Target
Sodium- and chloride-dependent glycine transporter 1
Ligand
BDBM50322429
Substrate
Meas. Tech.
ChEMBL_643222 (CHEMBL1177033)
EC50
30±n/a nM
Citation
 Pinard, EAlanine, AAlberati, DBender, MBorroni, EBourdeaux, PBrom, VBurner, SFischer, HHainzl, DHalm, RHauser, NJolidon, SLengyel, JMarty, HPMeyer, TMoreau, JLMory, RNarquizian, RNettekoven, MNorcross, RDPuellmann, BSchmid, PSchmitt, SStalder, HWermuth, RWettstein, JGZimmerli, D Selective GlyT1 inhibitors: discovery of [4-(3-fluoro-5-trifluoromethylpyridin-2-yl)piperazin-1-yl][5-methanesulfonyl-2-((S)-2,2,2-trifluoro-1-methylethoxy)phenyl]methanone (RG1678), a promising novel medicine to treat schizophrenia. J Med Chem 53:4603-14 (2010)  
Target
Name:
Sodium- and chloride-dependent glycine transporter 1
Synonyms:
GlyT-1 Glycine Transporters (GlyT1c) SC6A9_HUMAN Sodium- and chloride-dependent glycine transporter 1 Sodium- and chloride-dependent glycine transporter 1 (GlyT1c) Solute carrier family 6 member 9
Type:
Enzyme
Mol. Mass.:
78270.54
Organism:
Homo sapiens (Human)
Description:
P48067
Residue:
706
  
Inhibitor
Name:
BDBM50322429
Synonyms:
CHEMBL1171499 | rac-[5-Methanesulfonyl-2-(2,2,2-trifluoro-1-methyl-ethoxy)-phenyl]-[4-(4-trifluoromethylphenyl)-piperazin-1-yl]-methanone
Type:
Small organic molecule
Emp. Form.:
C22H22F6N2O4S
Mol. Mass.:
524.476
SMILES:
CC(Oc1ccc(cc1C(=O)N1CCN(CC1)c1ccc(cc1)C(F)(F)F)S(C)(=O)=O)C(F)(F)F
: