Target
Cathepsin D
Ligand
BDBM50322896
Substrate
Meas. Tech.
ChEMBL_644688 (CHEMBL1211667)
IC50
2200±n/a nM
Citation
 Clarke, BCutler, LDemont, EDingwall, CDunsdon, RHawkins, JHowes, CHussain, IMaile, GMatico, RMosley, JNaylor, AO'Brien, ARedshaw, SRowland, PSoleil, VSmith, KJSweitzer, STheobald, PVesey, DWalter, DSWayne, G BACE-1 hydroxyethylamine inhibitors using novel edge-to-face interaction with Arg-296. Bioorg Med Chem Lett 20:4639-44 (2010)  
Target
Name:
Cathepsin D
Synonyms:
CATD_HUMAN CTSD Cathepsin D heavy chain Cathepsin D precursor
Type:
Enzyme
Mol. Mass.:
44551.72
Organism:
Homo sapiens (Human)
Description:
Human proCathepsin D (SwissProt accession number P07339) was expressed in Sf9 cells, purified, and autoactivated.
Residue:
412
  
Inhibitor
Name:
BDBM50322896
Synonyms:
3-(N-benzyl-N-methylsulfamoyl)-N-((2S,3R)-4-((S)-1-(cyclohexylamino)-1-oxopropan-2-ylamino)-3-hydroxy-1-phenylbutan-2-yl)benzamide | CHEMBL1210339
Type:
Small organic molecule
Emp. Form.:
C34H44N4O5S
Mol. Mass.:
620.802
SMILES:
C[C@H](NC[C@@H](O)[C@H](Cc1ccccc1)NC(=O)c1cccc(c1)S(=O)(=O)N(C)Cc1ccccc1)C(=O)NC1CCCCC1
: