Target
Beta-secretase 2
Ligand
BDBM50322898
Substrate
Meas. Tech.
ChEMBL_644687 (CHEMBL1211666)
IC50
46000±n/a nM
Citation
 Clarke, BCutler, LDemont, EDingwall, CDunsdon, RHawkins, JHowes, CHussain, IMaile, GMatico, RMosley, JNaylor, AO'Brien, ARedshaw, SRowland, PSoleil, VSmith, KJSweitzer, STheobald, PVesey, DWalter, DSWayne, G BACE-1 hydroxyethylamine inhibitors using novel edge-to-face interaction with Arg-296. Bioorg Med Chem Lett 20:4639-44 (2010)  
Target
Name:
Beta-secretase 2
Synonyms:
AEPLC ASP1 Asp 1 Aspartyl protease 1 BACE2_HUMAN Beta-secretase (BACE) Beta-secretase 2 (BACE-2) Beta-site APP-cleaving enzyme 2 Memapsin-1 beta-Secretase (BACE-2)
Type:
Protein
Mol. Mass.:
56171.20
Organism:
Homo sapiens (Human)
Description:
Q9Y5Z0
Residue:
518
  
Inhibitor
Name:
BDBM50322898
Synonyms:
CHEMBL1210337 | N-((2S,3R)-4-((S)-1-(cyclohexylamino)-1-oxopropan-2-ylamino)-3-hydroxy-1-phenylbutan-2-yl)-3-(phenylsulfonylmethyl)benzamide
Type:
Small organic molecule
Emp. Form.:
C33H41N3O5S
Mol. Mass.:
591.761
SMILES:
C[C@H](NC[C@@H](O)[C@H](Cc1ccccc1)NC(=O)c1cccc(CS(=O)(=O)c2ccccc2)c1)C(=O)NC1CCCCC1
: