Target
Carbonic anhydrase 9
Ligand
BDBM50323341
Substrate
Meas. Tech.
ChEMBL_643931 (CHEMBL1211830)
Ki
49.5±n/a nM
Citation
 Avvaru, BSWagner, JMMaresca, AScozzafava, ARobbins, AHSupuran, CTMcKenna, R Carbonic anhydrase inhibitors. The X-ray crystal structure of human isoform II in adduct with an adamantyl analogue of acetazolamide resides in a less utilized binding pocket than most hydrophobic inhibitors. Bioorg Med Chem Lett 20:4376-81 (2010)  
Target
Name:
Carbonic anhydrase 9
Synonyms:
CA-IX CAH9_HUMAN Carbonic anhydrase 9 (CA IX) Carbonic anhydrase 9 precursor Carbonic anhydrase IX (CAIX) Carbonic anhydrases; II & IX MN RCC-associated antigen G250
Type:
Enzyme
Mol. Mass.:
49669.03
Organism:
Homo sapiens (Human)
Description:
Catalytic domain of human cloned isozyme was used in the assay
Residue:
459
  
Inhibitor
Name:
BDBM50323341
Synonyms:
CHEMBL1209039
Type:
Small organic molecule
Emp. Form.:
C14H20N4O3S2
Mol. Mass.:
356.464
SMILES:
NS(=O)(=O)c1nnc(NC(=O)CC23CC4CC(CC(C4)C2)C3)s1
: