Target
Carbonic anhydrase 5A, mitochondrial
Ligand
BDBM11641
Substrate
Meas. Tech.
ChEMBL_643927 (CHEMBL1211826)
Ki
88±n/a nM
Citation
 Avvaru, BSWagner, JMMaresca, AScozzafava, ARobbins, AHSupuran, CTMcKenna, R Carbonic anhydrase inhibitors. The X-ray crystal structure of human isoform II in adduct with an adamantyl analogue of acetazolamide resides in a less utilized binding pocket than most hydrophobic inhibitors. Bioorg Med Chem Lett 20:4376-81 (2010)  
Target
Name:
Carbonic anhydrase 5A, mitochondrial
Synonyms:
CA-VA CA5A Carbonate dehydratase VA Carbonic anhydrase 5A (CA VA) Carbonic anhydrase 5A, mitochondrial precursor Carbonic anhydrase VA (CA VA)
Type:
Enzyme
Mol. Mass.:
34755.54
Organism:
Homo sapiens (Human)
Description:
Human (cloned) isozyme
Residue:
305
  
Inhibitor
Name:
BDBM11641
Synonyms:
1-N-(4-sulfamoylphenyl-ethyl)-2,4,6-trimethylpyridiniumperchlorate CHEMBL352535 pyridinium deriv. 10
Type:
Small organic molecule
Emp. Form.:
C16H21N2O2S
Mol. Mass.:
305.415
SMILES:
Cc1cc(C)[n+](CCc2ccc(cc2)S(N)(=O)=O)c(C)c1
: