Target
Mitogen-activated protein kinase 14
Ligand
BDBM50323664
Substrate
Meas. Tech.
ChEMBL_645060 (CHEMBL1211566)
IC50
60±n/a nM
Citation
 Montalban, AGBoman, EChang, CDCeide, SCDahl, RDalesandro, DDelaet, NGErb, EErnst, JTGibbs, AKahl, JKessler, LKucharski, JLum, CLundström, JMiller, SNakanishi, HRoberts, ESaiah, ESullivan, RUrban, JWang, ZLarson, CJ Optimization of alpha-ketoamide based p38 inhibitors through modifications to the region that binds to the allosteric site. Bioorg Med Chem Lett 20:4819-24 (2010)  
Target
Name:
Mitogen-activated protein kinase 14
Synonyms:
CSAID-binding protein CSBP1 CSPB1 MAP kinase 14 MAP kinase p38 alpha MAPK14 MK14_HUMAN Mitogen-activated protein kinase p38 alpha Stress-activated protein kinase 2a | p38 MAP kinase alpha/beta
Type:
Serine/threonine-protein kinase
Mol. Mass.:
41286.76
Organism:
Homo sapiens (Human)
Description:
Q16539
Residue:
360
  
Inhibitor
Name:
BDBM50323664
Synonyms:
CHEMBL1208956 | N-(5-tert-butyl-3-cyano-2-methoxyphenyl)-2-oxo-2-(4-(pyridin-4-yl)naphthalen-1-yl)acetamide
Type:
Small organic molecule
Emp. Form.:
C29H25N3O3
Mol. Mass.:
463.5271
SMILES:
COc1c(NC(=O)C(=O)c2ccc(-c3ccncc3)c3ccccc23)cc(cc1C#N)C(C)(C)C
: