Target
Mitogen-activated protein kinase 14
Ligand
BDBM50323659
Substrate
Meas. Tech.
ChEMBL_645062 (CHEMBL1211568)
IC50
1±n/a nM
Citation
 Montalban, AGBoman, EChang, CDCeide, SCDahl, RDalesandro, DDelaet, NGErb, EErnst, JTGibbs, AKahl, JKessler, LKucharski, JLum, CLundström, JMiller, SNakanishi, HRoberts, ESaiah, ESullivan, RUrban, JWang, ZLarson, CJ Optimization of alpha-ketoamide based p38 inhibitors through modifications to the region that binds to the allosteric site. Bioorg Med Chem Lett 20:4819-24 (2010)  
Target
Name:
Mitogen-activated protein kinase 14
Synonyms:
CSAID-binding protein CSBP1 CSPB1 MAP kinase 14 MAP kinase p38 alpha MAPK14 MK14_HUMAN Mitogen-activated protein kinase p38 alpha Stress-activated protein kinase 2a | p38 MAP kinase alpha/beta
Type:
Serine/threonine-protein kinase
Mol. Mass.:
41286.76
Organism:
Homo sapiens (Human)
Description:
Q16539
Residue:
360
  
Inhibitor
Name:
BDBM50323659
Synonyms:
CHEMBL1208890 | N-(5-tert-butyl-2-methoxy-3-(methylsulfonamido)phenyl)-2-oxo-2-(4-(pyrimidin-4-ylamino)naphthalen-1-yl)acetamide
Type:
Small organic molecule
Emp. Form.:
C28H29N5O5S
Mol. Mass.:
547.625
SMILES:
COc1c(NC(=O)C(=O)c2ccc(Nc3ccncn3)c3ccccc23)cc(cc1NS(C)(=O)=O)C(C)(C)C
: