Target
Neuronal acetylcholine receptor subunit alpha-4/beta-2
Ligand
BDBM50323683
Substrate
Meas. Tech.
ChEMBL_645071 (CHEMBL1211577)
Ki
>615.5±n/a nM
Citation
 Lowe, JADeNinno, SLCoe, JWZhang, LMente, SHurst, RSMather, RJWard, KMShrikhande, ARollema, HJohnson, DEHorner, WGorczyca, RTingley, FDKozak, RMajchrzak, MJTritto, TSadlier, JShaffer, CLEllerbrock, BOsgood, SMMacDougall, MCMcDowell, LL A novel series of [3.2.1] azabicyclic biaryl ethers as alpha3beta4 and alpha6/4beta4 nicotinic receptor agonists. Bioorg Med Chem Lett 20:4749-52 (2010)  
Target
Name:
Neuronal acetylcholine receptor subunit alpha-4/beta-2
Synonyms:
Neuronal acetylcholine receptor Alpha-4/Beta-2 Neuronal acetylcholine receptor; alpha4/beta2 | nAChR subtypes alpha4 beta2
Type:
Protein
Mol. Mass.:
Description:
Components:
This complex has 2 components.
Component 1
Name:
Neuronal acetylcholine receptor subunit alpha-4
Synonyms:
ACHA4_HUMAN CHRNA4 protein Neuronal acetylcholine receptor protein alpha-4 subunit Nicotinic acetylcholine receptor alpha4/beta2/alpha5
Type:
Mol. Mass.:
69963.49
Organism:
Homo sapiens (Human)
Description:
NACHRA4
Residue:
627
  
Component 2
Name:
Neuronal acetylcholine receptor subunit beta-2
Synonyms:
ACHB2_HUMAN Neuronal acetylcholine receptor protein beta-2 subunit | Nicotinic acetylcholine receptor alpha3/beta2/alpha5
Type:
Protein
Mol. Mass.:
57020.50
Organism:
Homo sapiens (Human)
Description:
P17787
Residue:
502
  
Inhibitor
Name:
BDBM50323683
Synonyms:
CHEMBL1209305 | rac-exo-[6-(2-(5-Acetylaminopyridin-3-yl)phenoxy))]-3-azabicyclo[3.2.1]octane hydrochloride
Type:
Small organic molecule
Emp. Form.:
C20H23N3O2
Mol. Mass.:
337.4155
SMILES:
CC(=O)Nc1cncc(c1)-c1ccccc1O[C@H]1C[C@H]2C[C@@H]1CNC2
: