Target
Acidic mammalian chitinase
Ligand
BDBM50027028
Substrate
Meas. Tech.
ChEMBL_649681 (CHEMBL1219379)
IC50
101700±n/a nM
Citation
 Cole, DCOlland, AMJacob, JBrooks, JBursavich, MGCzerwinski, RDeClercq, CJohnson, MJoseph-McCarthy, DEllingboe, JWLin, LNowak, PPresman, EStrand, JTam, AWilliams, CMYao, STsao, DHFitz, LJ Identification and characterization of acidic mammalian chitinase inhibitors. J Med Chem 53:6122-8 (2010)  
Target
Name:
Acidic mammalian chitinase
Synonyms:
AMCase CHIA Lung-specific protein TSA1902
Type:
Protein
Mol. Mass.:
52266.66
Organism:
Homo sapiens (Human)
Description:
Q9BZP6
Residue:
476
  
Inhibitor
Name:
BDBM50027028
Synonyms:
2-(piperazin-1-yl)nicotinamide CHEMBL47688
Type:
Small organic molecule
Emp. Form.:
C10H14N4O
Mol. Mass.:
206.2444
SMILES:
NC(=O)c1cccnc1N1CCNCC1
: