Target
Mineralocorticoid receptor
Ligand
BDBM50324154
Substrate
Meas. Tech.
ChEMBL_649875 (CHEMBL1219573)
IC50
1090±n/a nM
Citation
 Arhancet, GBWoodard, SSIyanar, KCase, BLWoerndle, RDietz, JDGarland, DJCollins, JTPayne, MABlinn, JRPomposiello, SIHu, XHeron, MIHuang, HCLee, LF Discovery of novel cyanodihydropyridines as potent mineralocorticoid receptor antagonists. J Med Chem 53:5970-8 (2010)  
Target
Name:
Mineralocorticoid receptor
Synonyms:
MCR MLR NR3C2 | Nuclear receptor subfamily 3 group C member 2
Type:
Enzyme
Mol. Mass.:
107076.42
Organism:
Homo sapiens (Human)
Description:
P08235
Residue:
984
  
Inhibitor
Name:
BDBM50324154
Synonyms:
CHEMBL1215483 | Ethyl 4-(2-Chlorophenyl)-6-(4-chlorophenyl)-5-cyano-2-ethyl-1,4-dihydropyridine-3-carboxylate
Type:
Small organic molecule
Emp. Form.:
C22H18Cl2N2O2
Mol. Mass.:
413.297
SMILES:
CCOC(=O)C1=C(N=C(C)C(C#N)C1c1ccccc1Cl)c1ccc(Cl)cc1
: