Target
Mineralocorticoid receptor
Ligand
BDBM50324130
Substrate
Meas. Tech.
ChEMBL_649875 (CHEMBL1219573)
IC50
702±n/a nM
Citation
 Arhancet, GBWoodard, SSIyanar, KCase, BLWoerndle, RDietz, JDGarland, DJCollins, JTPayne, MABlinn, JRPomposiello, SIHu, XHeron, MIHuang, HCLee, LF Discovery of novel cyanodihydropyridines as potent mineralocorticoid receptor antagonists. J Med Chem 53:5970-8 (2010)  
Target
Name:
Mineralocorticoid receptor
Synonyms:
MCR MLR NR3C2 | Nuclear receptor subfamily 3 group C member 2
Type:
Enzyme
Mol. Mass.:
107076.42
Organism:
Homo sapiens (Human)
Description:
P08235
Residue:
984
  
Inhibitor
Name:
BDBM50324130
Synonyms:
3-tert-butyl 5-methyl 2,6-dimethyl-4-(3-(trifluoromethyl)phenyl)-1,4-dihydropyridine-3,5-dicarboxylate | CHEMBL1215125
Type:
Small organic molecule
Emp. Form.:
C21H24F3NO4
Mol. Mass.:
411.4148
SMILES:
COC(=O)C1C(C(C(=O)OC(C)(C)C)=C(C)N=C1C)c1cccc(c1)C(F)(F)F
: