Target
Mineralocorticoid receptor
Ligand
BDBM50324148
Substrate
Meas. Tech.
ChEMBL_649875 (CHEMBL1219573)
IC50
232±n/a nM
Citation
 Arhancet, GBWoodard, SSIyanar, KCase, BLWoerndle, RDietz, JDGarland, DJCollins, JTPayne, MABlinn, JRPomposiello, SIHu, XHeron, MIHuang, HCLee, LF Discovery of novel cyanodihydropyridines as potent mineralocorticoid receptor antagonists. J Med Chem 53:5970-8 (2010)  
Target
Name:
Mineralocorticoid receptor
Synonyms:
MCR MLR NR3C2 | Nuclear receptor subfamily 3 group C member 2
Type:
Enzyme
Mol. Mass.:
107076.42
Organism:
Homo sapiens (Human)
Description:
P08235
Residue:
984
  
Inhibitor
Name:
BDBM50324148
Synonyms:
CHEMBL1215405 | Methyl 4-(2-Chlorophenyl)-5-cyano-2-ethyl-1,4-dihydro-6-methylpyridine-3-carboxylate
Type:
Small organic molecule
Emp. Form.:
C17H17ClN2O2
Mol. Mass.:
316.782
SMILES:
CCC1=C(C(C(C#N)C(C)=N1)c1ccccc1Cl)C(=O)OC
: