Target
Progesterone receptor
Ligand
BDBM50324149
Substrate
Meas. Tech.
ChEMBL_649878 (CHEMBL1219576)
IC50
200±n/a nM
Citation
 Arhancet, GBWoodard, SSIyanar, KCase, BLWoerndle, RDietz, JDGarland, DJCollins, JTPayne, MABlinn, JRPomposiello, SIHu, XHeron, MIHuang, HCLee, LF Discovery of novel cyanodihydropyridines as potent mineralocorticoid receptor antagonists. J Med Chem 53:5970-8 (2010)  
Target
Name:
Progesterone receptor
Synonyms:
NR3C3 PGR PRGR_HUMAN | progesterone
Type:
Protein
Mol. Mass.:
98979.52
Organism:
Homo sapiens (Human)
Description:
P06401
Residue:
933
  
Inhibitor
Name:
BDBM50324149
Synonyms:
CHEMBL1215406 | Methyl 4-(2-Chlorophenyl)-5-cyano-1,4-dihydro-6-methyl-2-propylpyridine-3-carboxylate
Type:
Small organic molecule
Emp. Form.:
C18H19ClN2O2
Mol. Mass.:
330.809
SMILES:
CCCC1=C(C(C(C#N)C(C)=N1)c1ccccc1Cl)C(=O)OC
: