Target
Androgen receptor
Ligand
BDBM50324117
Substrate
Meas. Tech.
ChEMBL_649877 (CHEMBL1219575)
IC50
3900±n/a nM
Citation
 Arhancet, GBWoodard, SSIyanar, KCase, BLWoerndle, RDietz, JDGarland, DJCollins, JTPayne, MABlinn, JRPomposiello, SIHu, XHeron, MIHuang, HCLee, LF Discovery of novel cyanodihydropyridines as potent mineralocorticoid receptor antagonists. J Med Chem 53:5970-8 (2010)  
Target
Name:
Androgen receptor
Synonyms:
ANDR_HUMAN Androgen Receptor Androgen receptor/Baculoviral IAP repeat-containing protein 2 Dihydrotestosterone receptor Nuclear receptor subfamily 3 group C member 4
Type:
Receptor
Mol. Mass.:
99185.27
Organism:
Homo sapiens (Human)
Description:
CHO cells were stably transfected with human AR gene.
Residue:
920
  
Inhibitor
Name:
BDBM50324117
Synonyms:
CHEMBL1215552 | Methyl 2-((1H-Imidazol-1-yl)methyl)-4-(2-chloro-4-fluorophenyl)-5-cyano-6-methyl-1,4-dihydropyridine-3-carboxylate
Type:
Small organic molecule
Emp. Form.:
C19H16ClFN4O2
Mol. Mass.:
386.807
SMILES:
COC(=O)C1=C(Cn2ccnc2)N=C(C)C(C#N)C1c1ccc(F)cc1Cl
: