Target
Progesterone receptor
Ligand
BDBM50324116
Substrate
Meas. Tech.
ChEMBL_649878 (CHEMBL1219576)
IC50
7200±n/a nM
Citation
 Arhancet, GBWoodard, SSIyanar, KCase, BLWoerndle, RDietz, JDGarland, DJCollins, JTPayne, MABlinn, JRPomposiello, SIHu, XHeron, MIHuang, HCLee, LF Discovery of novel cyanodihydropyridines as potent mineralocorticoid receptor antagonists. J Med Chem 53:5970-8 (2010)  
Target
Name:
Progesterone receptor
Synonyms:
NR3C3 PGR PRGR_HUMAN | progesterone
Type:
Protein
Mol. Mass.:
98979.52
Organism:
Homo sapiens (Human)
Description:
P06401
Residue:
933
  
Inhibitor
Name:
BDBM50324116
Synonyms:
(R)-Methyl 2-((1H-Tetrazol-1-yl)methyl)-4-(2-chloro-4-fluorophenyl)-5-cyano-6-methyl-1,4-dihydropyridine-3-carboxylate | CHEMBL1215623
Type:
Small organic molecule
Emp. Form.:
C17H14ClFN6O2
Mol. Mass.:
388.783
SMILES:
COC(=O)C1=C(Cn2cnnn2)N=C(C)C(C#N)[C@H]1c1ccc(F)cc1Cl
: