Target
Amine oxidase [flavin-containing] B
Ligand
BDBM50049243
Substrate
Meas. Tech.
ChEMBL_651342 (CHEMBL1227162)
IC50
225±n/a nM
Citation
 Geldenhuys, WJDarvesh, ASFunk, MOVan der Schyf, CJCarroll, RT Identification of novel monoamine oxidase B inhibitors by structure-based virtual screening. Bioorg Med Chem Lett 20:5295-8 (2010)  
Target
Name:
Amine oxidase [flavin-containing] B
Synonyms:
AOFB_HUMAN MAOB Monoamine oxidase type B (MAO B) Monoamine oxidase type B (MAOB)
Type:
Protein
Mol. Mass.:
58768.76
Organism:
Homo sapiens (Human)
Description:
P27338
Residue:
520
  
Inhibitor
Name:
BDBM50049243
Synonyms:
5-[4-(1-Methyl-cyclohexylmethoxy)-benzyl]-thiazolidine-2,4-dione 5-[4-(1-Methyl-cyclohexylmethoxy)-benzyl]-thiazolidine-2,4-dione(Ciglitazone) CIGLITAZONE | US8637558, 112
Type:
Small organic molecule
Emp. Form.:
C18H23NO3S
Mol. Mass.:
333.445
SMILES:
CC1(COc2ccc(Cc3sc(=O)[nH]c3O)cc2)CCCCC1
: