Target
Carbonic anhydrase 2
Ligand
BDBM50067040
Substrate
Meas. Tech.
ChEMBL_651944 (CHEMBL1227474)
Ki
380±n/a nM
Citation
 Innocenti, AGülçin, IScozzafava, ASupuran, CT Carbonic anhydrase inhibitors. Antioxidant polyphenols effectively inhibit mammalian isoforms I-XV. Bioorg Med Chem Lett 20:5050-3 (2010)  
Target
Name:
Carbonic anhydrase 2
Synonyms:
CA-II CAC Carbonate dehydratase II Carbonic anhydrase 2 (CA-II) Carbonic anhydrase C Carbonic anhydrase II (CA-II) Carbonic anhydrase II (hCA II) | Carbonic anhydrase isoenzyme II (hCA II)
Type:
Enzyme
Mol. Mass.:
29250.71
Organism:
Homo sapiens (Human)
Description:
P00918
Residue:
260
  
Inhibitor
Name:
BDBM50067040
Synonyms:
((E,E)-1,7-bis(4-hydroxy-3-methoxyphenyl)-1,6-heptadiene-3,5-dione) (1E,4Z,6E)-5-hydroxy-1,7-bis(4-hydroxy-3-methoxyphenyl)hepta-1,4,6-trien-3-one (1E,6E)-1,7-bis(4-hydroxy-3-methoxyphenyl)-1,6-heptadiene-3,5-dione (1Z,6E)-1,7-Bis-(4-hydroxy-3-methoxy-phenyl)-hepta-1,6-diene-3,5-dione 1,7-Bis-(4-hydroxy-3-methoxy-phenyl)-hepta-1,6-diene-3,5-dione 1,7-bis(4-hydroxy-3-methoxyphenyl)-1,6-heptadiene-3,5-dione 1,7-bis(4-hydroxy-3-methoxyphenyl)hepta-1,6-diene-3,5-dione 5-Hydroxy-1,7-bis-(4-hydroxy-3-methoxy-phenyl)-hepta-1,4,6-trien-3-one CHEMBL116438 curcumin I curcurmin | diferuloylmethane
Type:
Small organic molecule
Emp. Form.:
C21H20O6
Mol. Mass.:
368.3799
SMILES:
COc1cc(C=CC(=O)CC(=O)C=Cc2ccc(O)c(OC)c2)ccc1O
: