Target
Carbonic anhydrase 4
Ligand
BDBM50325274
Substrate
Meas. Tech.
ChEMBL_651946 (CHEMBL1227476)
Ki
8980±n/a nM
Citation
 Innocenti, AGülçin, IScozzafava, ASupuran, CT Carbonic anhydrase inhibitors. Antioxidant polyphenols effectively inhibit mammalian isoforms I-XV. Bioorg Med Chem Lett 20:5050-3 (2010)  
Target
Name:
Carbonic anhydrase 4
Synonyms:
CA-IV CAH4_HUMAN Carbonic anhydrase Carbonic anhydrase IV (CA IV)
Type:
Enzyme
Mol. Mass.:
35037.98
Organism:
Homo sapiens (Human)
Description:
P22748
Residue:
312
  
Inhibitor
Name:
BDBM50325274
Synonyms:
4-{2-[3-(4-Hydroxy-phenyl)-1-methyl-propylamino]-ethyl}-benzene-1,2-diol CHEMBL926 Dobutrex | cid_36811
Type:
Small organic molecule
Emp. Form.:
C18H23NO3
Mol. Mass.:
301.3801
SMILES:
CC(CCc1ccc(O)cc1)NCCc1ccc(O)c(O)c1
: