Target
Carbonic anhydrase 12
Ligand
BDBM23926
Substrate
Meas. Tech.
ChEMBL_651952 (CHEMBL1227625)
Ki
950±n/a nM
Citation
 Innocenti, AGülçin, IScozzafava, ASupuran, CT Carbonic anhydrase inhibitors. Antioxidant polyphenols effectively inhibit mammalian isoforms I-XV. Bioorg Med Chem Lett 20:5050-3 (2010)  
Target
Name:
Carbonic anhydrase 12
Synonyms:
CA-XII CAH12_HUMAN Carbonic anhydrase Carbonic anhydrase XII Carbonic anhydrase XII (CAXII) | Tumor antigen HOM-RCC-3.1.3
Type:
Enzyme
Mol. Mass.:
39456.00
Organism:
Homo sapiens (Human)
Description:
Catalytic domain of human cloned isozyme was used in the assay
Residue:
354
  
Inhibitor
Name:
BDBM23926
Synonyms:
(E)-resveratrol CHEMBL165 Stilbene, 2f cid_445154 trans-resveratrol
Type:
Small organic molecule
Emp. Form.:
C14H12O3
Mol. Mass.:
228.2433
SMILES:
Oc1ccc(\C=C\c2cc(O)cc(O)c2)cc1
: