Target
Carbonic anhydrase 15
Ligand
BDBM50146462
Substrate
Meas. Tech.
ChEMBL_651955 (CHEMBL1227628)
Ki
>1000000±n/a nM
Citation
 Innocenti, AGülçin, IScozzafava, ASupuran, CT Carbonic anhydrase inhibitors. Antioxidant polyphenols effectively inhibit mammalian isoforms I-XV. Bioorg Med Chem Lett 20:5050-3 (2010)  
Target
Name:
Carbonic anhydrase 15
Synonyms:
CAH15_MOUSE Car15
Type:
PROTEIN
Mol. Mass.:
35484.02
Organism:
Mus musculus
Description:
ChEMBL_651955
Residue:
324
  
Inhibitor
Name:
BDBM50146462
Synonyms:
(2E)-3-(2-hydroxyphenyl)-2-propenoic acid (2E)-3-(2-hydroxyphenyl)prop-2-enoic acid (7) (E)-3-(2-hydroxyphenyl)-2-propenoic acid CHEMBL52564 o-hydroxy-trans-cinnamic acid trans-o-hydroxycinnamic acid
Type:
Small organic molecule
Emp. Form.:
C9H8O3
Mol. Mass.:
164.158
SMILES:
OC(=O)\C=C\c1ccccc1O
: