Target
Prostaglandin G/H synthase 1
Ligand
BDBM22360
Substrate
Meas. Tech.
ChEMBL_657535 (CHEMBL1246810)
IC50
750410±n/a nM
Citation
 Khan, KMAmbreen, NMughal, URJalil, SPerveen, SChoudhary, MI 3-Formylchromones: potential antiinflammatory agents. Eur J Med Chem 45:4058-64 (2010)  
Target
Name:
Prostaglandin G/H synthase 1
Synonyms:
COX-1 Cyclooxygenase Cyclooxygenase-1 (COX-1) PTGS1 | Prostaglandin G/H synthase (cyclooxygenase)
Type:
Enzyme
Mol. Mass.:
68692.62
Organism:
Homo sapiens (Human)
Description:
P23219
Residue:
599
  
Inhibitor
Name:
BDBM22360
Synonyms:
2-(acetyloxy)benzoate Acetylsalicylic acid Endosprin Zorprin cid_2244
Type:
Anti-Inflammatory Agents, Non-Steroidal
Emp. Form.:
C9H8O4
Mol. Mass.:
180.1574
SMILES:
CC(=O)Oc1ccccc1C(O)=O
: