Target
Cannabinoid receptor 1
Ligand
BDBM50326219
Substrate
Meas. Tech.
ChEMBL_659599 (CHEMBL1248894)
Ki
<1000±n/a nM
Citation
 Sams, AGHentzer, MMikkelsen, GKLarsen, KBundgaard, CPlath, NChristoffersen, CTBang-Andersen, B Discovery of N-{1-[3-(3-oxo-2,3-dihydrobenzo[1,4]oxazin-4-yl)propyl]piperidin-4-yl}-2-phenylacetamide (Lu AE51090): an allosteric muscarinic M1 receptor agonist with unprecedented selectivity and procognitive potential. J Med Chem 53:6386-97 (2010)  
Target
Name:
Cannabinoid receptor 1
Synonyms:
CANN6 CB-R CNR CNR1_HUMAN Cannabinoid receptor Cannabinoid receptor 1 (brain)
Type:
G Protein-Coupled Receptor (GPCR)
Mol. Mass.:
52868.96
Organism:
Homo sapiens (Human)
Description:
P21554
Residue:
472
  
Inhibitor
Name:
BDBM50326219
Synonyms:
4-(4-butylpiperidin-1-yl)-1-o-tolylbutan-1-one CHEMBL2206334
Type:
Small organic molecule
Emp. Form.:
C20H31NO
Mol. Mass.:
301.4662
SMILES:
CCCCC1CCN(CCCC(=O)c2ccccc2C)CC1
: