Target
Mitogen-activated protein kinase 14
Ligand
BDBM50326219
Substrate
Meas. Tech.
ChEMBL_659487 (CHEMBL1248540)
Ki
<1000±n/a nM
Citation
 Sams, AGHentzer, MMikkelsen, GKLarsen, KBundgaard, CPlath, NChristoffersen, CTBang-Andersen, B Discovery of N-{1-[3-(3-oxo-2,3-dihydrobenzo[1,4]oxazin-4-yl)propyl]piperidin-4-yl}-2-phenylacetamide (Lu AE51090): an allosteric muscarinic M1 receptor agonist with unprecedented selectivity and procognitive potential. J Med Chem 53:6386-97 (2010)  
Target
Name:
Mitogen-activated protein kinase 14
Synonyms:
CSAID-binding protein CSBP1 CSPB1 MAP kinase 14 MAP kinase p38 alpha MAPK14 MK14_HUMAN Mitogen-activated protein kinase p38 alpha Stress-activated protein kinase 2a | p38 MAP kinase alpha/beta
Type:
Serine/threonine-protein kinase
Mol. Mass.:
41286.76
Organism:
Homo sapiens (Human)
Description:
Q16539
Residue:
360
  
Inhibitor
Name:
BDBM50326219
Synonyms:
4-(4-butylpiperidin-1-yl)-1-o-tolylbutan-1-one CHEMBL2206334
Type:
Small organic molecule
Emp. Form.:
C20H31NO
Mol. Mass.:
301.4662
SMILES:
CCCCC1CCN(CCCC(=O)c2ccccc2C)CC1
: