Target
Muscarinic acetylcholine receptor M1
Ligand
BDBM50263887
Substrate
Meas. Tech.
ChEMBL_659441 (CHEMBL1248351)
EC50
6.5±n/a nM
Citation
 Sams, AGHentzer, MMikkelsen, GKLarsen, KBundgaard, CPlath, NChristoffersen, CTBang-Andersen, B Discovery of N-{1-[3-(3-oxo-2,3-dihydrobenzo[1,4]oxazin-4-yl)propyl]piperidin-4-yl}-2-phenylacetamide (Lu AE51090): an allosteric muscarinic M1 receptor agonist with unprecedented selectivity and procognitive potential. J Med Chem 53:6386-97 (2010)  
Target
Name:
Muscarinic acetylcholine receptor M1
Synonyms:
ACM1_HUMAN Cholinergic receptor, muscarinic 1 | Cholinergic, muscarinic M1
Type:
Protein
Mol. Mass.:
51442.54
Organism:
Homo sapiens (Human)
Description:
P11229
Residue:
460
  
Inhibitor
Name:
BDBM50263887
Synonyms:
1-(1'-(2-methylbenzyl)-1,4'-bipiperidin-4-yl)-1H-benzo[d]imidazol-2(3H)-one CHEMBL522460
Type:
Small organic molecule
Emp. Form.:
C25H32N4O
Mol. Mass.:
404.5478
SMILES:
Cc1ccccc1CN1CCC(CC1)N1CCC(CC1)n1c2ccccc2[nH]c1=O
: