Target
Muscarinic acetylcholine receptor M1
Ligand
BDBM50326217
Substrate
Meas. Tech.
ChEMBL_659441 (CHEMBL1248351)
EC50
13±n/a nM
Citation
 Sams, AGHentzer, MMikkelsen, GKLarsen, KBundgaard, CPlath, NChristoffersen, CTBang-Andersen, B Discovery of N-{1-[3-(3-oxo-2,3-dihydrobenzo[1,4]oxazin-4-yl)propyl]piperidin-4-yl}-2-phenylacetamide (Lu AE51090): an allosteric muscarinic M1 receptor agonist with unprecedented selectivity and procognitive potential. J Med Chem 53:6386-97 (2010)  
Target
Name:
Muscarinic acetylcholine receptor M1
Synonyms:
ACM1_HUMAN Cholinergic receptor, muscarinic 1 | Cholinergic, muscarinic M1
Type:
Protein
Mol. Mass.:
51442.54
Organism:
Homo sapiens (Human)
Description:
P11229
Residue:
460
  
Inhibitor
Name:
BDBM50326217
Synonyms:
CHEMBL1242979 | N-{1-[3-(6,7-Difluoro-2-oxo-3,4-dihydro-2H-quinolin-1-yl)-propyl]-piperidin-4-yl}-2-(3,4-dimethoxy-phenyl)-acetamide
Type:
Small organic molecule
Emp. Form.:
C27H33F2N3O4
Mol. Mass.:
501.5654
SMILES:
COc1ccc(CC(=O)NC2CCN(CCCN3C(=O)CCc4cc(F)c(F)cc34)CC2)cc1OC
: