Target
Muscarinic acetylcholine receptor M5
Ligand
BDBM50122054
Substrate
Meas. Tech.
ChEMBL_659452 (CHEMBL1248362)
Ki
51±n/a nM
Citation
 Sams, AGHentzer, MMikkelsen, GKLarsen, KBundgaard, CPlath, NChristoffersen, CTBang-Andersen, B Discovery of N-{1-[3-(3-oxo-2,3-dihydrobenzo[1,4]oxazin-4-yl)propyl]piperidin-4-yl}-2-phenylacetamide (Lu AE51090): an allosteric muscarinic M1 receptor agonist with unprecedented selectivity and procognitive potential. J Med Chem 53:6386-97 (2010)  
Target
Name:
Muscarinic acetylcholine receptor M5
Synonyms:
ACM5_HUMAN | CHRM5
Type:
PROTEIN
Mol. Mass.:
60102.35
Organism:
Homo sapiens (Human)
Description:
ChEMBL_1517990
Residue:
532
  
Inhibitor
Name:
BDBM50122054
Synonyms:
8-Chloro-11-piperazin-1-yl-5H-dibenzo[b,e][1,4]diazepine N-Demethylclozapine USRE49340, Rank 7
Type:
Small organic molecule
Emp. Form.:
C17H17ClN4
Mol. Mass.:
312.797
SMILES:
Clc1ccc2Nc3ccccc3C(=Nc2c1)N1CCNCC1
: