Target
Dipeptidyl peptidase 9
Ligand
BDBM50146971
Substrate
Meas. Tech.
ChEMBL_657415 (CHEMBL1246391)
IC50
>100000±n/a nM
Citation
 Tsai, TYYeh, TKChen, XHsu, TJao, YCHuang, CHSong, JSHuang, YCChien, CHChiu, JHYen, SCTang, HKChao, YSJiaang, WT Substituted 4-carboxymethylpyroglutamic acid diamides as potent and selective inhibitors of fibroblast activation protein. J Med Chem 53:6572-83 (2010)  
Target
Name:
Dipeptidyl peptidase 9
Synonyms:
DPP9 DPRP-2 Dipeptidyl peptidase 9 (DDP9) Dipeptidyl peptidase 9 (DPP9) Dipeptidyl peptidase IX Dipeptidyl peptidase-like protein 9
Type:
Enzyme
Mol. Mass.:
98260.70
Organism:
Homo sapiens (Human)
Description:
Q86TI2
Residue:
863
  
Inhibitor
Name:
BDBM50146971
Synonyms:
2-(S)-Amino-4-(2-chloro-benzylamino)-1-piperidin-1-yl-butan-1-one | CHEMBL98762
Type:
Small organic molecule
Emp. Form.:
C16H24ClN3O
Mol. Mass.:
309.834
SMILES:
N[C@@H](CCNCc1ccccc1Cl)C(=O)N1CCCCC1
: