Target
Cyclin-dependent kinase 5
Ligand
BDBM50378824
Substrate
Meas. Tech.
ChEMBL_660570 (CHEMBL1250278)
IC50
25000±n/a nM
Citation
 Sridhar, JAkula, NPattabiraman, N Selectivity and potency of cyclin-dependent kinase inhibitors. AAPS J 8:204-21 (2006)  
Target
Name:
Cyclin-dependent kinase 5
Synonyms:
CDK5 CDKN5 Cyclin-dependent kinase 5 (CDK5/ p25) Cyclin-dependent-like kinase 5 PSSALRE Tau protein kinase II catalytic subunit
Type:
Enzyme Subunit
Mol. Mass.:
33308.61
Organism:
Homo sapiens (Human)
Description:
Residue:
292
  
Inhibitor
Name:
BDBM50378824
Synonyms:
CHEMBL1242367
Type:
Small organic molecule
Emp. Form.:
C27H32N6O
Mol. Mass.:
456.5826
SMILES:
CCNc1cc(N[C@@H]2CC[C@H](O)CC2)nc(Nc2ccc3n(Cc4ccccc4)ccc3c2)n1
: