Target
Galectin-3
Ligand
BDBM50326584
Substrate
Meas. Tech.
ChEMBL_661835 (CHEMBL1252151)
Kd
230000±n/a nM
Citation
 Salameh, BACumpstey, ISundin, ALeffler, HNilsson, UJ 1H-1,2,3-triazol-1-yl thiodigalactoside derivatives as high affinity galectin-3 inhibitors. Bioorg Med Chem 18:5367-78 (2010)  
Target
Name:
Galectin-3
Synonyms:
LEG3_HUMAN MAC2
Type:
Enzyme
Mol. Mass.:
26156.54
Organism:
Homo sapiens (Human)
Description:
P17931
Residue:
250
  
Inhibitor
Name:
BDBM50326584
Synonyms:
CHEMBL1254847 | Methyl-3-(4-methylaminocarbonyl-1H-[1,2,3]-triazol-1-yl)-3-deoxy-1-thio-beta-D-galactopyranoside
Type:
Small organic molecule
Emp. Form.:
C11H18N4O5S
Mol. Mass.:
318.349
SMILES:
CNC(=O)c1cn(nn1)[C@H]1[C@@H](O)[C@@H](CO)O[C@@H](SC)[C@@H]1O
: