Target
Galectin-9
Ligand
BDBM50326584
Substrate
Meas. Tech.
ChEMBL_661838 (CHEMBL1252154)
Kd
1100000±n/a nM
Citation
 Salameh, BACumpstey, ISundin, ALeffler, HNilsson, UJ 1H-1,2,3-triazol-1-yl thiodigalactoside derivatives as high affinity galectin-3 inhibitors. Bioorg Med Chem 18:5367-78 (2010)  
Target
Name:
Galectin-9
Synonyms:
LEG9_HUMAN | LGALS9
Type:
PROTEIN
Mol. Mass.:
39532.33
Organism:
Homo sapiens (Human)
Description:
ChEMBL_1454626
Residue:
355
  
Inhibitor
Name:
BDBM50326584
Synonyms:
CHEMBL1254847 | Methyl-3-(4-methylaminocarbonyl-1H-[1,2,3]-triazol-1-yl)-3-deoxy-1-thio-beta-D-galactopyranoside
Type:
Small organic molecule
Emp. Form.:
C11H18N4O5S
Mol. Mass.:
318.349
SMILES:
CNC(=O)c1cn(nn1)[C@H]1[C@@H](O)[C@@H](CO)O[C@@H](SC)[C@@H]1O
: