Target
Kappa-type opioid receptor
Ligand
BDBM21015
Substrate
Meas. Tech.
ChEMBL_662215 (CHEMBL1252307)
Ki
>5000±n/a nM
Citation
 Pasquinucci, LPrezzavento, OMarrazzo, AAmata, ERonsisvalle, SGeorgoussi, ZFourla, DDScoto, GMParenti, CAricò, GRonsisvalle, G Evaluation of N-substitution in 6,7-benzomorphan compounds. Bioorg Med Chem 18:4975-82 (2010)  
Target
Name:
Kappa-type opioid receptor
Synonyms:
Kappa Opioid Receptor OPRK1 Opiate Kappa 1 | mu/kappa opioid receptor
Type:
G Protein-Coupled Receptor (GPCR)
Mol. Mass.:
42744.99
Organism:
Cavia porcellus (domestic guinea pig)
Description:
P41144
Residue:
380
  
Inhibitor
Name:
BDBM21015
Synonyms:
(2S)-2-{2-[(2R)-2-[(2S)-2-amino-3-(4-hydroxyphenyl)propanamido]propanamido]-N-methylacetamido}-N-(2-hydroxyethyl)-3-phenylpropanamide CHEMBL38874 DAMGO US11492374, ID 2 [tyrosyl-3,5-3H(N)]-D-Ala2-Mephe4-glyol5-enkephalin
Type:
Analgesics
Emp. Form.:
C26H35N5O6
Mol. Mass.:
513.586
SMILES:
C[C@@H](NC(=O)[C@@H](N)Cc1ccc(O)cc1)C(=O)NCC(=O)N(C)[C@@H](Cc1ccccc1)C(=O)NCCO
: