Target
Coagulation factor X
Ligand
BDBM17135
Substrate
Meas. Tech.
ChEMBL_675275 (CHEMBL1273257)
Ki
0.005±n/a nM
Citation
 Pinto, DJSmallheer, JMCheney, DLKnabb, RMWexler, RR Factor Xa inhibitors: next-generation antithrombotic agents. J Med Chem 53:6243-74 (2010)  
Target
Name:
Coagulation factor X
Synonyms:
Activated coagulation factor X (FXa) Coagulation factor X precursor F10 Factor X heavy chain Factor Xa Stuart-Prower factor
Type:
Enzyme
Mol. Mass.:
54726.60
Organism:
Homo sapiens (Human)
Description:
Residue:
488
  
Inhibitor
Name:
BDBM17135
Synonyms:
3-chloro-N-{4-chloro-2-[(5-chloropyridin-2-yl)carbamoyl]-6-methoxyphenyl}-4-{[2-(methylamino)-1H-imidazol-1-yl]methyl}thiophene-2-carboxamide ZK 813039 | ZK813039
Type:
Small organic molecule
Emp. Form.:
C23H19Cl3N6O3S
Mol. Mass.:
565.859
SMILES:
CNc1nccn1Cc1csc(C(=O)Nc2c(OC)cc(Cl)cc2C(=O)Nc2ccc(Cl)cn2)c1Cl
: