Target
Androgen receptor
Ligand
BDBM50329704
Substrate
Meas. Tech.
ChEMBL_675519 (CHEMBL1273732)
Ki
1000±n/a nM
Citation
 Maruyama, KNoguchi-Yachide, TSugita, KHashimoto, YIshikawa, M Novel selective anti-androgens with a diphenylpentane skeleton. Bioorg Med Chem Lett 20:6661-6 (2010)  
Target
Name:
Androgen receptor
Synonyms:
ANDR_HUMAN Androgen Receptor Androgen receptor/Baculoviral IAP repeat-containing protein 2 Dihydrotestosterone receptor Nuclear receptor subfamily 3 group C member 4
Type:
Receptor
Mol. Mass.:
99185.27
Organism:
Homo sapiens (Human)
Description:
CHO cells were stably transfected with human AR gene.
Residue:
920
  
Inhibitor
Name:
BDBM50329704
Synonyms:
(R)-3-(4-(3-(4-((R)-2-hydroxy-3,3-dimethylbutoxy)-3-methylphenyl)pentan-3-yl)-2-methylphenoxy)propane-1,2-diol | CHEMBL403670
Type:
Small organic molecule
Emp. Form.:
C28H42O5
Mol. Mass.:
458.6301
SMILES:
CCC(CC)(c1ccc(OC[C@H](O)CO)c(C)c1)c1ccc(OC[C@H](O)C(C)(C)C)c(C)c1
: