Target
Isoform 4 of Lethal(3)malignant brain tumor-like protein 1 (4)
Ligand
BDBM50330500
Substrate
Meas. Tech.
ChEMBL_684948 (CHEMBL1286363)
IC50
96000±n/a nM
Citation
 Kireev, DWigle, TJNorris-Drouin, JHerold, JMJanzen, WPFrye, SV Identification of non-peptide malignant brain tumor (MBT) repeat antagonists by virtual screening of commercially available compounds. J Med Chem 53:7625-31 (2010)  
Target
Name:
Isoform 4 of Lethal(3)malignant brain tumor-like protein 1 (4)
Synonyms:
H-l(3)mbt KIAA0681 L(3)mbt-like L3MBTL LMBL1_HUMAN Lethal(3)malignant brain tumor-like protein 1 (4) | Lethal(3)malignant brain tumor-like protein 1 (L3MBTL1)
Type:
Protein
Mol. Mass.:
83871.06
Organism:
Homo sapiens (Human)
Description:
Q9Y468-4
Residue:
752
  
Inhibitor
Name:
BDBM50330500
Synonyms:
4-(4-chloro-3-ethylphenoxy)-N-methylbutan-1-amine | CHEMBL1275706
Type:
Small organic molecule
Emp. Form.:
C13H20ClNO
Mol. Mass.:
241.757
SMILES:
CCc1cc(OCCCCNC)ccc1Cl
: