Target
Transient receptor potential cation channel subfamily V member 1
Ligand
BDBM50333931
Substrate
Meas. Tech.
ChEMBL_700255 (CHEMBL1647473)
EC50
1.14±n/a nM
Citation
 Lim, KSKang, DWKim, YSKim, MSPark, SGChoi, SPearce, LVBlumberg, PMLee, J Receptor activity and conformational analysis of 5'-halogenated resiniferatoxin analogs as TRPV1 ligands. Bioorg Med Chem Lett 21:299-302 (2010)  
Target
Name:
Transient receptor potential cation channel subfamily V member 1
Synonyms:
Capsaicin receptor TRPV1_RAT Trpv1 Vanilloid VR1 Vanilloid receptor 1 (VRI/TRPV1) Vanilloid receptor type 1-like (TrpV1/Vr1) Vr1l | osm-9-like TRP channel 1
Type:
Transient Receptor
Mol. Mass.:
94956.12
Organism:
Rattus norvegicus (rat)
Description:
O35433
Residue:
838
  
Inhibitor
Name:
BDBM50333931
Synonyms:
CHEMBL1644420 | [(2R,6R,10S,15S,17R)-13-benzyl-6-hydroxy-4,17-dimethyl-5-oxo-15-(prop-1-en-2-yl)-12,14,18-trioxapentacyclo[11.4.1.0^{1,10}.0^{2,6}.0^{11,15}]octadeca-3,8-dien-8-yl]methyl 2-(4-amino-3-fluoro-5-methoxyphenyl)acetate
Type:
Small organic molecule
Emp. Form.:
C37H40FNO8
Mol. Mass.:
645.7138
SMILES:
COc1cc(CC(=O)OCC2=C[C@H]3C4OC5(Cc6ccccc6)O[C@@]4(C[C@@H](C)C3(O5)[C@@H]3C=C(C)C(=O)[C@@]3(O)C2)C(C)=C)cc(F)c1N
: