Target
Insulin receptor
Ligand
BDBM50334088
Substrate
Meas. Tech.
ChEMBL_701401 (CHEMBL1649021)
IC50
30±n/a nM
Citation
 Weinberg, LRAlbom, MSAngeles, TSHusten, JLisko, JGMcHugh, RJMilkiewicz, KLMurthy, SOtt, GRTheroff, JPTripathy, RUnderiner, TLZificsak, CADorsey, BD Fused bicyclic derivatives of 2,4-diaminopyrimidine as c-Met inhibitors. Bioorg Med Chem Lett 21:164-7 (2010)  
Target
Name:
Insulin receptor
Synonyms:
INSR INSR_HUMAN Insulin receptor beta subunit
Type:
Receptor Tyrosine Kinase
Mol. Mass.:
156322.60
Organism:
Homo sapiens (Human)
Description:
P06213
Residue:
1382
  
Inhibitor
Name:
BDBM50334088
Synonyms:
2-(5-chloro-2-(5,5-dimethyl-2-oxo-2,3,4,5-tetrahydro-1H-benzo[b]azepin-7-ylamino)pyrimidin-4-ylamino)-N-methylbenzamide | CHEMBL1644804
Type:
Small organic molecule
Emp. Form.:
C24H25ClN6O2
Mol. Mass.:
464.947
SMILES:
CNC(=O)c1ccccc1Nc1nc(Nc2ccc3NC(=O)CCC(C)(C)c3c2)ncc1Cl
: