Target
Insulin receptor
Ligand
BDBM50334084
Substrate
Meas. Tech.
ChEMBL_701401 (CHEMBL1649021)
IC50
153±n/a nM
Citation
 Weinberg, LRAlbom, MSAngeles, TSHusten, JLisko, JGMcHugh, RJMilkiewicz, KLMurthy, SOtt, GRTheroff, JPTripathy, RUnderiner, TLZificsak, CADorsey, BD Fused bicyclic derivatives of 2,4-diaminopyrimidine as c-Met inhibitors. Bioorg Med Chem Lett 21:164-7 (2010)  
Target
Name:
Insulin receptor
Synonyms:
INSR INSR_HUMAN Insulin receptor beta subunit
Type:
Receptor Tyrosine Kinase
Mol. Mass.:
156322.60
Organism:
Homo sapiens (Human)
Description:
P06213
Residue:
1382
  
Inhibitor
Name:
BDBM50334084
Synonyms:
2-[5-Chloro-2-(5,5-dimethyl-2-oxo-2,3,4,5-tetrahydro-1H-benzo[b]azepin-8-ylamino)-pyrimidin-4-ylamino]-3-fluoro-N-methyl-benzamide | CHEMBL1644811
Type:
Small organic molecule
Emp. Form.:
C24H24ClFN6O2
Mol. Mass.:
482.938
SMILES:
CNC(=O)c1cccc(F)c1Nc1nc(Nc2ccc3c(NC(=O)CCC3(C)C)c2)ncc1Cl
: