Target
Cholinesterase
Ligand
BDBM8958
Substrate
Meas. Tech.
ChEMBL_699910 (CHEMBL1646129)
Ki
12100000±n/a nM
Citation
 Musilek, KRoder, JKomloova, MHolas, OHrabinova, MPohanka, MDohnal, VOpletalova, VKuca, KJung, YS Preparation, in vitro screening and molecular modelling of symmetrical 4-tert-butylpyridinium cholinesterase inhibitors--analogues of SAD-128. Bioorg Med Chem Lett 21:150-4 (2010)  
Target
Name:
Cholinesterase
Synonyms:
Acylcholine acylhydrolase Butyrylcholine esterase (BChE) Butyrylcholinesterase (BuChE) CHLE_HUMAN Cholinesterases Pseudocholinesterase
Type:
Homotetramer
Mol. Mass.:
68422.27
Organism:
Homo sapiens (Human)
Description:
P06276
Residue:
602
  
Inhibitor
Name:
BDBM8958
Synonyms:
10-(2-diethylaminopropyl)phenothiazine CHEMBL1206 diethyl[1-(10H-phenothiazin-10-yl)propan-2-yl]amine
Type:
Small organic molecule
Emp. Form.:
C19H24N2S
Mol. Mass.:
312.472
SMILES:
CCN(CC)C(C)CN1c2ccccc2Sc2ccccc12
: