Target
Delta-type opioid receptor
Ligand
BDBM50334996
Substrate
Meas. Tech.
ChEMBL_702694 (CHEMBL1657768)
EC50
0.160000±n/a nM
Citation
 Cowell, SMHanlon, KE Development of potent µ and d opioid agonists with high lipophilicity. J Med Chem 54:382-6 (2011)  
Target
Name:
Delta-type opioid receptor
Synonyms:
D-OR-1 Delta opioid receptor OPIATE Delta OPRD1 OPRK1 | opioid receptor, delta 1
Type:
G Protein-Coupled Receptor (GPCR)
Mol. Mass.:
40382.98
Organism:
Homo sapiens (Human)
Description:
Competition binding assays were carried out using membrane preparations from transfected HN9.10 cells that constitutively expressed the delta opioid receptor.
Residue:
372
  
Inhibitor
Name:
BDBM50334996
Synonyms:
(S)-2-amino-N-((R)-1-(2-((S)-3-(4-chlorophenyl)-1-oxo-1-(4-(N-phenylpropionamido)piperidin-1-yl)propan-2-ylamino)-2-oxoethylamino)-1-oxopropan-2-yl)-3-(4-hydroxy-2,6-dimethylphenyl)propanamide | CHEMBL1649943
Type:
Small organic molecule
Emp. Form.:
C39H49ClN6O6
Mol. Mass.:
733.296
SMILES:
CCC(=O)N(C1CCN(CC1)C(=O)[C@H](Cc1ccc(Cl)cc1)NC(=O)CNC(=O)[C@@H](C)NC(=O)[C@@H](N)Cc1c(C)cc(O)cc1C)c1ccccc1
: