Target
Sodium/glucose cotransporter 2
Ligand
BDBM50335145
Substrate
Meas. Tech.
ChEMBL_702889 (CHEMBL1655514)
EC50
161±n/a nM
Citation
 Chang, CCChao, YSChen, CTChiu, CHChu, KFHsiao, WCHsieh, CJYuan, MCHsieh, TCHuang, CYHung, MSLee, JCLiu, YWSong, JSTsai, CHWang, MHWu, SHYao, CHYeh, TK Discovery of novel N-ß-D-xylosylindole derivatives as sodium-dependent glucose cotransporter 2 (SGLT2) inhibitors for the management of hyperglycemia in diabetes. J Med Chem 54:166-78 (2011)  
Target
Name:
Sodium/glucose cotransporter 2
Synonyms:
Na(+)/glucose cotransporter 2 SGLT2 Sodium-Dependent Glucose Cotransporter 2 (SGLT2) Solute carrier family 5 member 2
Type:
Protein
Mol. Mass.:
72902.00
Organism:
Homo sapiens (Human)
Description:
P31639
Residue:
672
  
Inhibitor
Name:
BDBM50335145
Synonyms:
4-Chloro-3-(4-cyclopropylbenzyl)-1-(beta-D-xylopyranosyl)-1Hindole | CHEMBL1650501
Type:
Small organic molecule
Emp. Form.:
C23H24ClNO4
Mol. Mass.:
413.894
SMILES:
O[C@@H]1CO[C@H]([C@H](O)[C@H]1O)n1cc(Cc2ccc(cc2)C2CC2)c2c(Cl)cccc12
: