Target
Potassium voltage-gated channel subfamily H member 2
Ligand
BDBM50335157
Substrate
Meas. Tech.
ChEMBL_701537 (CHEMBL1656176)
IC50
16000±n/a nM
Citation
 Ballentine, SKColburn, RWDamiano, BPFlores, CMHutchinson, TLIllig, CRLiu, YLubin, MLMa, JMeegalla, SKParks, DJBaker, JFParsons, WHPlayer, MRQin, NSchneider, CRStone, DJ Design and optimization of benzimidazole-containing transient receptor potential melastatin 8 (TRPM8) antagonists. J Med Chem 54:233-47 (2011)  
Target
Name:
Potassium voltage-gated channel subfamily H member 2
Synonyms:
1,3-beta-glucan synthase component GLS2 ERG Eag-related protein 1 Ether-a-go-go-related gene (HERG) Ether-a-go-go-related gene potassium channel 1 Ether-a-go-go-related gene potassium channel 1 (hERG1) Ether-a-go-go-related protein 1 H-ERG KCNH2 Potassium voltage-gated channel subfamily H member 2 (hERG) Voltage-gated potassium channel subunit Kv11.1 hERG Potassium Channel 1 | putative potassium channel subunit
Type:
Multi-pass membrane protein
Mol. Mass.:
126672.65
Organism:
Homo sapiens (Human)
Description:
Q12809
Residue:
1159
  
Inhibitor
Name:
BDBM50335157
Synonyms:
3-[7-Trifluoromethyl-5-(2-trifluoromethyl-phenyl)-1H-benzimidazol-2-yl]-1-oxa-2-aza-spiro[4.5]dec-2-ene | CHEMBL1650511
Type:
Small organic molecule
Emp. Form.:
C23H19F6N3O
Mol. Mass.:
467.4069
SMILES:
FC(F)(F)c1ccccc1-c1cc(c2[nH]c(nc2c1)C1=NOC2(C1)CCCCC2)C(F)(F)F
: