Target
Cytochrome P450 2C9
Ligand
BDBM50335161
Substrate
Meas. Tech.
ChEMBL_702904 (CHEMBL1655529)
IC50
2200±n/a nM
Citation
 Ballentine, SKColburn, RWDamiano, BPFlores, CMHutchinson, TLIllig, CRLiu, YLubin, MLMa, JMeegalla, SKParks, DJBaker, JFParsons, WHPlayer, MRQin, NSchneider, CRStone, DJ Design and optimization of benzimidazole-containing transient receptor potential melastatin 8 (TRPM8) antagonists. J Med Chem 54:233-47 (2011)  
Target
Name:
Cytochrome P450 2C9
Synonyms:
(R)-limonene 6-monooxygenase CP2C9_HUMAN CYP2C9 Cytochrome P450 2C9 (CYP2C9 ) P-450MP P450 PB-1 | S-mephenytoin 4-hydroxylase
Type:
Enzyme
Mol. Mass.:
55636.33
Organism:
Homo sapiens (Human)
Description:
P11712
Residue:
490
  
Inhibitor
Name:
BDBM50335161
Synonyms:
3-[7-Bromo-5-(2-trifluoromethylphenyl)-1H-benzimidazol-2-yl]-1-oxa-2-aza-spiro[4.5]dec-2-ene | CHEMBL1650524
Type:
Small organic molecule
Emp. Form.:
C22H19BrF3N3O
Mol. Mass.:
478.305
SMILES:
FC(F)(F)c1ccccc1-c1cc(Br)c2[nH]c(nc2c1)C1=NOC2(C1)CCCCC2
: