Target
Aurora kinase B
Ligand
BDBM50335183
Substrate
Meas. Tech.
ChEMBL_701675 (CHEMBL1656567)
IC50
79±n/a nM
Citation
 Kerekes, ADEsposite, SJTagat, JRXiao, YTerracina, GA Aurora kinase inhibitors based on the imidazo[1,2-a]pyrazine core: fluorine and deuterium incorporation improve oral absorption and exposure. J Med Chem 54:201-10 (2011)  
Target
Name:
Aurora kinase B
Synonyms:
AIK2 AIM1 ARK2 AURKB_HUMAN Aurora B-INCENP Aurora kinase B (AURKB) STK-1 STK12 Serine/threonine-protein kinase aurora B
Type:
Protein
Mol. Mass.:
39327.72
Organism:
Homo sapiens (Human)
Description:
Q96GD4
Residue:
344
  
Inhibitor
Name:
BDBM50335183
Synonyms:
CHEMBL1650540 | N-[3-[(3,3-Difluoro-1-piperidinyl)methyl]-5-isothiazolyl]-6-methyl-3-(1H-pyrazol-4-yl)imidazo[1,2-a]pyrazin-8-amine Hydrochloride
Type:
Small organic molecule
Emp. Form.:
C19H20F2N8S
Mol. Mass.:
430.478
SMILES:
Cc1cn2c(cnc2c(Nc2cc(CN3CCCC(F)(F)C3)ns2)n1)-c1cn[nH]c1
: