Target
Aurora kinase B
Ligand
BDBM50335184
Substrate
Meas. Tech.
ChEMBL_701675 (CHEMBL1656567)
IC50
218±n/a nM
Citation
 Kerekes, ADEsposite, SJTagat, JRXiao, YTerracina, GA Aurora kinase inhibitors based on the imidazo[1,2-a]pyrazine core: fluorine and deuterium incorporation improve oral absorption and exposure. J Med Chem 54:201-10 (2011)  
Target
Name:
Aurora kinase B
Synonyms:
AIK2 AIM1 ARK2 AURKB_HUMAN Aurora B-INCENP Aurora kinase B (AURKB) STK-1 STK12 Serine/threonine-protein kinase aurora B
Type:
Protein
Mol. Mass.:
39327.72
Organism:
Homo sapiens (Human)
Description:
Q96GD4
Residue:
344
  
Inhibitor
Name:
BDBM50335184
Synonyms:
6-Methyl-3-(1H-pyrazol-4-yl)-N-[3-[[4-(trifluoromethyl)-1-piperidinyl]methyl]-5-isothiazolyl]imidazo[1,2-a]pyrazin-8-amine Hydrochloride | CHEMBL1650541
Type:
Small organic molecule
Emp. Form.:
C20H21F3N8S
Mol. Mass.:
462.495
SMILES:
Cc1cn2c(cnc2c(Nc2cc(CN3CCC(CC3)C(F)(F)F)ns2)n1)-c1cn[nH]c1
: