Target
Procathepsin L
Ligand
BDBM50335281
Substrate
Meas. Tech.
ChEMBL_702782 (CHEMBL1655225)
Ki
0.045±n/a nM
Citation
 Frizler, MLohr, FFurtmann, NKläs, JGütschow, M Structural optimization of azadipeptide nitriles strongly increases association rates and allows the development of selective cathepsin inhibitors. J Med Chem 54:396-400 (2011)  
Target
Name:
Procathepsin L
Synonyms:
CATL1_HUMAN CTSL CTSL1 Cathepsin L Cathepsin L1 heavy chain MEP cathepsin L preproprotein
Type:
Enzyme
Mol. Mass.:
37557.19
Organism:
Homo sapiens (Human)
Description:
Purchased from Calbiochem (San Diego, CA).
Residue:
333
  
Inhibitor
Name:
BDBM50335281
Synonyms:
CHEMBL1651355 | N-(Phenylcarbamoyl)-leucyl-methylazaalanine-nitrile
Type:
Small organic molecule
Emp. Form.:
C16H23N5O2
Mol. Mass.:
317.3861
SMILES:
CC(C)C[C@H](NC(=O)Nc1ccccc1)C(=O)N(C)N(C)C#N
: