Target
Procathepsin L
Ligand
BDBM50335286
Substrate
Meas. Tech.
ChEMBL_702782 (CHEMBL1655225)
Ki
4700±n/a nM
Citation
 Frizler, MLohr, FFurtmann, NKläs, JGütschow, M Structural optimization of azadipeptide nitriles strongly increases association rates and allows the development of selective cathepsin inhibitors. J Med Chem 54:396-400 (2011)  
Target
Name:
Procathepsin L
Synonyms:
CATL1_HUMAN CTSL CTSL1 Cathepsin L Cathepsin L1 heavy chain MEP cathepsin L preproprotein
Type:
Enzyme
Mol. Mass.:
37557.19
Organism:
Homo sapiens (Human)
Description:
Purchased from Calbiochem (San Diego, CA).
Residue:
333
  
Inhibitor
Name:
BDBM50335286
Synonyms:
CHEMBL1651358 | N-{4-[5-(2-Thienyl)-1,2,4-oxadiazol-3-yl]phenylcarbamoyl}-leucyl-glycine-nitrile
Type:
Small organic molecule
Emp. Form.:
C21H22N6O3S
Mol. Mass.:
438.503
SMILES:
CC(C)C[C@H](NC(=O)Nc1ccc(cc1)-c1noc(n1)-c1cccs1)C(=O)NCC#N
: