Target
Adenosine deaminase
Ligand
BDBM50335313
Substrate
Meas. Tech.
ChEMBL_702792 (CHEMBL1655235)
Ki
40±n/a nM
Citation
 Gillerman, IFischer, B Investigations into the origin of the molecular recognition of several adenosine deaminase inhibitors. J Med Chem 54:107-21 (2011)  
Target
Name:
Adenosine deaminase
Synonyms:
ADA ADA_HUMAN | Adenosine aminohydrolase
Type:
Enzyme
Mol. Mass.:
40759.44
Organism:
Homo sapiens (Human)
Description:
Human recombinant ADA was expressed and purified from an ADA-deficient bacterial strain.
Residue:
363
  
Inhibitor
Name:
BDBM50335313
Synonyms:
8-aza-nebularine | CHEMBL1651380
Type:
Small organic molecule
Emp. Form.:
C9H11N5O4
Mol. Mass.:
253.2147
SMILES:
OC[C@H]1O[C@H]([C@H](O)[C@@H]1O)n1nnc2cncnc12
: