Target
Adenosine deaminase
Ligand
BDBM50300878
Substrate
Meas. Tech.
ChEMBL_702791 (CHEMBL1655234)
Ki
5900±n/a nM
Citation
 Gillerman, IFischer, B Investigations into the origin of the molecular recognition of several adenosine deaminase inhibitors. J Med Chem 54:107-21 (2011)  
Target
Name:
Adenosine deaminase
Synonyms:
ADA Adenosine aminohydrolase
Type:
Enzyme
Mol. Mass.:
40910.44
Organism:
Bos taurus (bovine)
Description:
Residue:
363
  
Inhibitor
Name:
BDBM50300878
Synonyms:
(2R,3R,4S,5R)-2-(6-amino-2-(hexylthio)-9H-purin-9-yl)-5-(hydroxymethyl)tetrahydrofuran-3,4-diol | CHEMBL577915
Type:
Small organic molecule
Emp. Form.:
C16H25N5O4S
Mol. Mass.:
383.466
SMILES:
CCCCCCSc1nc(N)c2ncn([C@@H]3O[C@H](CO)[C@@H](O)[C@H]3O)c2n1
: