Target
Adenosine deaminase
Ligand
BDBM50335305
Substrate
Meas. Tech.
ChEMBL_702791 (CHEMBL1655234)
Ki
>100000±n/a nM
Citation
 Gillerman, IFischer, B Investigations into the origin of the molecular recognition of several adenosine deaminase inhibitors. J Med Chem 54:107-21 (2011)  
Target
Name:
Adenosine deaminase
Synonyms:
ADA Adenosine aminohydrolase
Type:
Enzyme
Mol. Mass.:
40910.44
Organism:
Bos taurus (bovine)
Description:
Residue:
363
  
Inhibitor
Name:
BDBM50335305
Synonyms:
(2R,3S,4R,5R)-2-(hydroxymethyl)-5-(8-mercapto-9H-purin-9-yl)tetrahydrofuran-3,4-diol | CHEMBL1651375
Type:
Small organic molecule
Emp. Form.:
C10H12N4O4S
Mol. Mass.:
284.292
SMILES:
OC[C@H]1O[C@H]([C@H](O)[C@@H]1O)n1c2ncncc2[nH]c1=S
: